Project

General

Profile

Bug #1239

Updated by Rogers, Chris almost 10 years ago

 
 

 => lib/libPyROOT.so done 
 bin/rmkdepend -R -fio/xmlparser/src/TDOMParser.d -Y -w 1000 -- -pipe -m64 -Wshadow -Wall -W -Woverloaded-virtual -fPIC -Iinclude    -pthread -I/data/mice/mice/carlisle/maus/third_party/install/include/libxml2 -D__cplusplus -- /data/mice/mice/carlisle/maus0.5/third_party/build/root_v5.30.03/io/xmlparser/src/TDOMParser.cxx 
 g++ -O2 -pipe -m64 -Wshadow -Wall -W -Woverloaded-virtual -fPIC -Iinclude    -pthread -I/data/mice/mice/carlisle/maus/third_party/install/include/libxml2 -o io/xmlparser/src/TDOMParser.o -c /data/mice/mice/carlisle/maus0.5/third_party/build/root_v5.30.03/io/xmlparser/src/TDOMParser.cxx 
 /data/mice/mice/carlisle/maus0.5/third_party/build/root_v5.30.03/io/xmlparser/src/TDOMParser.cxx:29:25: error: libxml/tree.h: No such file or directory 
 /data/mice/mice/carlisle/maus0.5/third_party/build/root_v5.30.03/io/xmlparser/src/TDOMParser.cxx:30:36: error: libxml/parserInternals.h: No such file or directory 
 /data/mice/mice/carlisle/maus0.5/third_party/build/root_v5.30.03/io/xmlparser/src/TDOMParser.cxx: In member function 'virtual Int_t TDOMParser::ParseFile(const char*)': 
 /data/mice/mice/carlisle/maus0.5/third_party/build/root_v5.30.03/io/xmlparser/src/TDOMParser.cxx:74: error: 'xmlCreateFileParserCtxt' was not declared in this scope 
 /data/mice/mice/carlisle/maus0.5/third_party/build/root_v5.30.03/io/xmlparser/src/TDOMParser.cxx:83: error: invalid use of undefined type 'struct _xmlParserCtxt' 
 include/TXMLParser.h:43: error: forward declaration of 'struct _xmlParserCtxt' 
 /data/mice/mice/carlisle/maus0.5/third_party/build/root_v5.30.03/io/xmlparser/src/TDOMParser.cxx:84: error: 'xmlParserGetDirectory' was not declared in this scope 
 /data/mice/mice/carlisle/maus0.5/third_party/build/root_v5.30.03/io/xmlparser/src/TDOMParser.cxx:85: error: invalid use of undefined type 'struct _xmlParserCtxt' 
 include/TXMLParser.h:43: error: forward declaration of 'struct _xmlParserCtxt' 
 /data/mice/mice/carlisle/maus0.5/third_party/build/root_v5.30.03/io/xmlparser/src/TDOMParser.cxx:85: error: ISO C++ forbids declaration of 'type name' with no type 
 /data/mice/mice/carlisle/maus0.5/third_party/build/root_v5.30.03/io/xmlparser/src/TDOMParser.cxx:85: error: ISO C++ forbids declaration of 'type name' with no type 
 /data/mice/mice/carlisle/maus0.5/third_party/build/root_v5.30.03/io/xmlparser/src/TDOMParser.cxx:85: error: expected primary-expression before 'char' 
 /data/mice/mice/carlisle/maus0.5/third_party/build/root_v5.30.03/io/xmlparser/src/TDOMParser.cxx:85: error: expected `)' before 'char' 
 /data/mice/mice/carlisle/maus0.5/third_party/build/root_v5.30.03/io/xmlparser/src/TDOMParser.cxx:84: warning: unused variable 'dir' 
 /data/mice/mice/carlisle/maus0.5/third_party/build/root_v5.30.03/io/xmlparser/src/TDOMParser.cxx: In member function 'virtual Int_t TDOMParser::ParseBuffer(const char*, Int_t)': 
 /data/mice/mice/carlisle/maus0.5/third_party/build/root_v5.30.03/io/xmlparser/src/TDOMParser.cxx:98: error: 'xmlCreateMemoryParserCtxt' was not declared in this scope 
 /data/mice/mice/carlisle/maus0.5/third_party/build/root_v5.30.03/io/xmlparser/src/TDOMParser.cxx: In member function 'Int_t TDOMParser::ParseContext()': 
 /data/mice/mice/carlisle/maus0.5/third_party/build/root_v5.30.03/io/xmlparser/src/TDOMParser.cxx:119: error: 'xmlParseDocument' was not declared in this scope 
 /data/mice/mice/carlisle/maus0.5/third_party/build/root_v5.30.03/io/xmlparser/src/TDOMParser.cxx:121: error: invalid use of undefined type 'struct _xmlParserCtxt' 
 include/TXMLParser.h:43: error: forward declaration of 'struct _xmlParserCtxt' 
 /data/mice/mice/carlisle/maus0.5/third_party/build/root_v5.30.03/io/xmlparser/src/TDOMParser.cxx:126: error: invalid use of undefined type 'struct _xmlParserCtxt' 
 include/TXMLParser.h:43: error: forward declaration of 'struct _xmlParserCtxt' 
 /data/mice/mice/carlisle/maus0.5/third_party/build/root_v5.30.03/io/xmlparser/src/TDOMParser.cxx:131: error: invalid use of undefined type 'struct _xmlParserCtxt' 
 include/TXMLParser.h:43: error: forward declaration of 'struct _xmlParserCtxt' 
 /data/mice/mice/carlisle/maus0.5/third_party/build/root_v5.30.03/io/xmlparser/src/TDOMParser.cxx:136: error: invalid use of undefined type 'struct _xmlParserCtxt' 
 include/TXMLParser.h:43: error: forward declaration of 'struct _xmlParserCtxt' 
 make: *** [io/xmlparser/src/TDOMParser.o] Error 1 
 FAIL: Failed to configure/make 

 the same version of ROOT builds fine in prev. Maus versions. I'll try to source a working copy of root in the meantime. 

 Thanks, 

 Tim 

Back