Project

General

Profile

Bug #1956 ยป application_tests.log

Franchini, Paolo, 15 February 2018 17:20

 
1

    
2
INFO: Running integration tests : test_scifi
3

    
4
TestSciFiRecon: Run helical simulation & check the output (LSQ) ... Info in <TCanvas::MakeDefCanvas>:  created default TCanvas with name c1
5
FAIL
6
TestSciFiRecon: Run helical sim & check the output (MINUIT) ... FAIL
7
TestSciFiRecon: Run the straight simulation and check the output ... ok
8

    
9
======================================================================
10
FAIL: TestSciFiRecon: Run helical simulation & check the output (LSQ)
11
----------------------------------------------------------------------
12
Traceback (most recent call last):
13
  File "/var/lib/jenkins/workspace/MAUS_integration_tests/tests/integration/test_scifi/test_scifi_recon_helical/test_scifi_recon_helical.py", line 88, in test_helical_recon_lsq
14
    self.assertLess(h6.GetRMS(), 2)
15
AssertionError: 2.403158013235865 not less than 2
16
-------------------- >> begin captured stdout << ---------------------
17
Using /var/lib/jenkins/workspace/MAUS_integration_tests/tests/integration/test_scifi/test_scifi_recon_helical/simulate_scifi.py
18
Running simulate_scifi, logging in tmp/test_scifi_recon_helical_lsq.log
19

    
20
--------------------- >> end captured stdout << ----------------------
21

    
22
======================================================================
23
FAIL: TestSciFiRecon: Run helical sim & check the output (MINUIT)
24
----------------------------------------------------------------------
25
Traceback (most recent call last):
26
  File "/var/lib/jenkins/workspace/MAUS_integration_tests/tests/integration/test_scifi/test_scifi_recon_helical/test_scifi_recon_helical.py", line 123, in test_helical_recon_minuit
27
    self.assertLess(h8.GetMean(), 1.0)
28
AssertionError: 1.030432716026525 not less than 1.0
29
-------------------- >> begin captured stdout << ---------------------
30
Using /var/lib/jenkins/workspace/MAUS_integration_tests/tests/integration/test_scifi/test_scifi_recon_helical/simulate_scifi.py
31
Running simulate_scifi, logging in tmp/test_scifi_recon_helical_minuit.log
32

    
33
--------------------- >> end captured stdout << ----------------------
34

    
35
----------------------------------------------------------------------
36
Ran 3 tests in 414.104s
37

    
38
FAILED (failures=2)
    (1-1/1)